Target
Intestinal-type alkaline phosphatase 1
Ligand
BDBM76157
Substrate
Meas. Tech.
Dose Response concentration confirmation of uHTS hits from a small molecule activators of mouse intestinal alkaline phosphatase via a luminescent assay
EC50
57900±n/a nM
Citation
 PubChem, PC Dose Response concentration confirmation of uHTS hits from a small molecule activators of mouse intestinal alkaline phosphatase via a luminescent assay PubChem Bioassay (2010)[AID] 
Target
Name:
Intestinal-type alkaline phosphatase 1
Synonyms:
Alpi | PPBI1_RAT
Type:
Enzyme Catalytic Domain
Mol. Mass.:
58396.39
Organism:
Rattus norvegicus (Rat)
Description:
P15693
Residue:
540
  
Inhibitor
Name:
BDBM76157
Synonyms:
MLS001096064 N-(2,4-dimethylphenyl)-2-[methyl-[(2-oxidanylidene-3H-1,3-benzoxazol-6-yl)sulfonyl]amino]ethanamide SMR000631036 | cid_20949419
Type:
Small organic molecule
Emp. Form.:
C18H19N3O5S
Mol. Mass.:
389.426
SMILES:
CN(CC(=O)Nc1ccc(C)cc1C)S(=O)(=O)c1ccc2[nH]c(=O)oc2c1
: