Target
Intestinal-type alkaline phosphatase 1
Ligand
BDBM76168
Substrate
Meas. Tech.
Dose Response confirmation of uHTS hits from a small molecule inhibitors of mouse intestinal alkaline phosphatase via a luminescent assay
IC50
4030±n/a nM
Citation
 PubChem, PC Dose Response confirmation of uHTS hits from a small molecule inhibitors of mouse intestinal alkaline phosphatase via a luminescent assay PubChem Bioassay (2010)[AID] 
Target
Name:
Intestinal-type alkaline phosphatase 1
Synonyms:
Alpi | PPBI1_RAT
Type:
Enzyme Catalytic Domain
Mol. Mass.:
58396.39
Organism:
Rattus norvegicus (Rat)
Description:
P15693
Residue:
540
  
Inhibitor
Name:
BDBM76168
Synonyms:
4-[2-(3-Methyl-pyridin-2-ylamino)-thiazol-4-yl]-benzene-1,2-diol 4-[2-[(3-methyl-2-pyridyl)amino]thiazol-4-yl]pyrocatechol MLS000123807 cid_751869
Type:
Small organic molecule
Emp. Form.:
C15H13N3O2S
Mol. Mass.:
299.348
SMILES:
Cc1cccnc1Nc1nc(cs1)-c1ccc(O)c(O)c1
: