Target
Intestinal-type alkaline phosphatase 1
Ligand
BDBM76181
Substrate
Meas. Tech.
Dose Response confirmation of uHTS hits from a small molecule inhibitors of mouse intestinal alkaline phosphatase via a luminescent assay
IC50
15700±n/a nM
Citation
 PubChem, PC Dose Response confirmation of uHTS hits from a small molecule inhibitors of mouse intestinal alkaline phosphatase via a luminescent assay PubChem Bioassay (2010)[AID] 
Target
Name:
Intestinal-type alkaline phosphatase 1
Synonyms:
Alpi | PPBI1_RAT
Type:
Enzyme Catalytic Domain
Mol. Mass.:
58396.39
Organism:
Rattus norvegicus (Rat)
Description:
P15693
Residue:
540
  
Inhibitor
Name:
BDBM76181
Synonyms:
MLS000693879 N-(2,5-dimethylphenyl)-2-oxidanylidene-3H-1,3-benzoxazole-6-sulfonamide N-(2,5-dimethylphenyl)-2-oxo-3H-1,3-benzoxazole-6-sulfonamide cid_974154
Type:
Small organic molecule
Emp. Form.:
C15H14N2O4S
Mol. Mass.:
318.348
SMILES:
Cc1ccc(C)c(NS(=O)(=O)c2ccc3[nH]c(=O)oc3c2)c1
: