Target
Intestinal-type alkaline phosphatase 1
Ligand
BDBM63549
Substrate
Meas. Tech.
Dose Response confirmation of uHTS hits from a small molecule inhibitors of mouse intestinal alkaline phosphatase via a luminescent assay
IC50
27600±n/a nM
Citation
 PubChem, PC Dose Response confirmation of uHTS hits from a small molecule inhibitors of mouse intestinal alkaline phosphatase via a luminescent assay PubChem Bioassay (2010)[AID] 
Target
Name:
Intestinal-type alkaline phosphatase 1
Synonyms:
Alpi | PPBI1_RAT
Type:
Enzyme Catalytic Domain
Mol. Mass.:
58396.39
Organism:
Rattus norvegicus (Rat)
Description:
P15693
Residue:
540
  
Inhibitor
Name:
BDBM63549
Synonyms:
MLS000710930 N,N-dimethyl-4-[(1-methylbenzimidazol-2-yl)diazenyl]aniline cid_2851304 | dimethyl-[4-(1-methylbenzimidazol-2-yl)azophenyl]amine
Type:
Small organic molecule
Emp. Form.:
C16H17N5
Mol. Mass.:
279.3397
SMILES:
CN(C)c1ccc(cc1)\N=N\c1nc2ccccc2n1C
: