Target
Intestinal-type alkaline phosphatase 1
Ligand
BDBM76188
Substrate
Meas. Tech.
Dose Response confirmation of uHTS hits from a small molecule inhibitors of mouse intestinal alkaline phosphatase via a luminescent assay
IC50
5660±n/a nM
Citation
 PubChem, PC Dose Response confirmation of uHTS hits from a small molecule inhibitors of mouse intestinal alkaline phosphatase via a luminescent assay PubChem Bioassay (2010)[AID] 
Target
Name:
Intestinal-type alkaline phosphatase 1
Synonyms:
Alpi | PPBI1_RAT
Type:
Enzyme Catalytic Domain
Mol. Mass.:
58396.39
Organism:
Rattus norvegicus (Rat)
Description:
P15693
Residue:
540
  
Inhibitor
Name:
BDBM76188
Synonyms:
1-methyl-5-methylsulfonyl-3-nitro-1,2,4-triazole MLS000678365 cid_3148843
Type:
Small organic molecule
Emp. Form.:
C4H6N4O4S
Mol. Mass.:
206.18
SMILES:
Cn1nc(nc1S(C)(=O)=O)[N+]([O-])=O
: