Target
Intestinal-type alkaline phosphatase 1
Ligand
BDBM57954
Substrate
Meas. Tech.
Dose Response confirmation of uHTS hits from a small molecule inhibitors of mouse intestinal alkaline phosphatase via a luminescent assay
IC50
998±n/a nM
Citation
 PubChem, PC Dose Response confirmation of uHTS hits from a small molecule inhibitors of mouse intestinal alkaline phosphatase via a luminescent assay PubChem Bioassay (2010)[AID] 
Target
Name:
Intestinal-type alkaline phosphatase 1
Synonyms:
Alpi | PPBI1_RAT
Type:
Enzyme Catalytic Domain
Mol. Mass.:
58396.39
Organism:
Rattus norvegicus (Rat)
Description:
P15693
Residue:
540
  
Inhibitor
Name:
BDBM57954
Synonyms:
1-[4-(difluoromethylthio)phenyl]-3-(diphenylmethyl)thiourea 1-benzhydryl-3-[4-(difluoromethylsulfanyl)phenyl]thiourea MLS000770683 cid_2434104
Type:
Small organic molecule
Emp. Form.:
C21H18F2N2S2
Mol. Mass.:
400.508
SMILES:
FC(F)Sc1ccc(NC(=S)NC(c2ccccc2)c2ccccc2)cc1
: