Target
Intestinal-type alkaline phosphatase 1
Ligand
BDBM71291
Substrate
Meas. Tech.
Dose Response confirmation of uHTS hits from a small molecule inhibitors of mouse intestinal alkaline phosphatase via a luminescent assay
IC50
3230±n/a nM
Citation
 PubChem, PC Dose Response confirmation of uHTS hits from a small molecule inhibitors of mouse intestinal alkaline phosphatase via a luminescent assay PubChem Bioassay (2010)[AID] 
Target
Name:
Intestinal-type alkaline phosphatase 1
Synonyms:
Alpi | PPBI1_RAT
Type:
Enzyme Catalytic Domain
Mol. Mass.:
58396.39
Organism:
Rattus norvegicus (Rat)
Description:
P15693
Residue:
540
  
Inhibitor
Name:
BDBM71291
Synonyms:
(5E)-3-benzyl-5-(2,3-dihydroxybenzylidene)-2-thioxo-thiazolidin-4-one (5E)-5-[(2,3-dihydroxyphenyl)methylidene]-3-(phenylmethyl)-2-sulfanylidene-4-thiazolidinone 3-benzyl-5-(2,3-dihydroxybenzylidene)-2-thioxo-1,3-thiazolidin-4-one SMR000497264 | cid_2291671
Type:
Small organic molecule
Emp. Form.:
C17H13NO3S2
Mol. Mass.:
343.42
SMILES:
Oc1cccc(\C=C2\SC(=S)N(Cc3ccccc3)C2=O)c1O
: