Target
Intestinal-type alkaline phosphatase 1
Ligand
BDBM76201
Substrate
Meas. Tech.
Dose Response confirmation of uHTS hits from a small molecule inhibitors of mouse intestinal alkaline phosphatase via a luminescent assay
IC50
1280±n/a nM
Citation
 PubChem, PC Dose Response confirmation of uHTS hits from a small molecule inhibitors of mouse intestinal alkaline phosphatase via a luminescent assay PubChem Bioassay (2010)[AID] 
Target
Name:
Intestinal-type alkaline phosphatase 1
Synonyms:
Alpi | PPBI1_RAT
Type:
Enzyme Catalytic Domain
Mol. Mass.:
58396.39
Organism:
Rattus norvegicus (Rat)
Description:
P15693
Residue:
540
  
Inhibitor
Name:
BDBM76201
Synonyms:
MLS001207297 N-[(5Z)-5-[(3,4-dihydroxyphenyl)methylidene]-4-oxo-2-sulfanylidene-1,3-thiazolidin-3-yl]benzamide N-[(5Z)-5-[[3,4-bis(oxidanyl)phenyl]methylidene]-4-oxidanylidene-2-sulfanylidene-1,3-thiazolidin-3-yl]benzamide SMR000515623 | cid_1725045
Type:
Small organic molecule
Emp. Form.:
C17H12N2O4S2
Mol. Mass.:
372.418
SMILES:
Oc1ccc(\C=C2/SC(=S)N(NC(=O)c3ccccc3)C2=O)cc1O
: