Target
Intestinal-type alkaline phosphatase 1
Ligand
BDBM53127
Substrate
Meas. Tech.
Dose Response confirmation of uHTS hits from a small molecule inhibitors of mouse intestinal alkaline phosphatase via a luminescent assay
IC50
9520±n/a nM
Citation
 PubChem, PC Dose Response confirmation of uHTS hits from a small molecule inhibitors of mouse intestinal alkaline phosphatase via a luminescent assay PubChem Bioassay (2010)[AID] 
Target
Name:
Intestinal-type alkaline phosphatase 1
Synonyms:
Alpi | PPBI1_RAT
Type:
Enzyme Catalytic Domain
Mol. Mass.:
58396.39
Organism:
Rattus norvegicus (Rat)
Description:
P15693
Residue:
540
  
Inhibitor
Name:
BDBM53127
Synonyms:
3-[3-(3-Furan-2-yl-acryloyl)-thioureido]-benzoic acid 3-[[(E)-3-(furan-2-yl)prop-2-enoyl]carbamothioylamino]benzoic acid MLS001211481 cid_845479
Type:
Small organic molecule
Emp. Form.:
C15H12N2O4S
Mol. Mass.:
316.332
SMILES:
OC(=O)c1cccc(NC(=S)NC(=O)C=Cc2ccco2)c1
: