Target
Integrin alpha-4
Ligand
BDBM76254
Substrate
Meas. Tech.
SAR Confirmatory Dose Response LIBS Assay for Allosteric Ligands of the VLA-4 Integrin
EC50
>69840±n/a nM
Citation
 PubChem, PC SAR Confirmatory Dose Response LIBS Assay for Allosteric Ligands of the VLA-4 Integrin PubChem Bioassay (2010)[AID] 
Target
Name:
Integrin alpha-4
Synonyms:
CD49 antigen-like family member D CD49d antigen ITA4_HUMAN Integrin alpha-4 Integrin alpha-IV VLA-4 integrin alpha 4 precursor | integrin alpha-4 precursor
Type:
Membrane Protein
Mol. Mass.:
114897.35
Organism:
Homo sapiens (Human)
Description:
P13612
Residue:
1032
  
Inhibitor
Name:
BDBM76254
Synonyms:
1-[2-[4-(2-thiophen-3-yl-1-benzothiophen-3-yl)phenoxy]ethyl]piperidine 1-[2-[4-[2-(3-thiophenyl)-1-benzothiophen-3-yl]phenoxy]ethyl]piperidine cid_44202259
Type:
Small organic molecule
Emp. Form.:
C25H25NOS2
Mol. Mass.:
419.602
SMILES:
C(CN1CCCCC1)Oc1ccc(cc1)-c1c(sc2ccccc12)-c1ccsc1
: