Target
Integrin alpha-4
Ligand
BDBM75441
Substrate
Meas. Tech.
SAR Confirmatory Dose Response LIBS Assay for Allosteric Ligands of the VLA-4 Integrin
EC50
>42950±n/a nM
Citation
 PubChem, PC SAR Confirmatory Dose Response LIBS Assay for Allosteric Ligands of the VLA-4 Integrin PubChem Bioassay (2010)[AID] 
Target
Name:
Integrin alpha-4
Synonyms:
CD49 antigen-like family member D CD49d antigen ITA4_HUMAN Integrin alpha-4 Integrin alpha-IV VLA-4 integrin alpha 4 precursor | integrin alpha-4 precursor
Type:
Membrane Protein
Mol. Mass.:
114897.35
Organism:
Homo sapiens (Human)
Description:
P13612
Residue:
1032
  
Inhibitor
Name:
BDBM75441
Synonyms:
1-[2-[4-[2-(3-methoxyphenyl)-1-benzothiophen-3-yl]phenoxy]ethyl]pyrrolidine 22GK (17c) SMR001397795 | cid_44202271
Type:
Small organic molecule
Emp. Form.:
C27H27NO2S
Mol. Mass.:
429.574
SMILES:
COc1cccc(c1)-c1sc2ccccc2c1-c1ccc(OCCN2CCCC2)cc1
: