Target
NACHT, LRR and PYD domains-containing protein 3
Ligand
BDBM76262
Substrate
Meas. Tech.
Dose Response confirmation of uHTS for the identification of inhibitors of NALP3 in yeast using a luminescent assay
IC50
8190±n/a nM
Citation
 PubChem, PC Dose Response confirmation of uHTS for the identification of inhibitors of NALP3 in yeast using a luminescent assay PubChem Bioassay (2010)[AID] 
Target
Name:
NACHT, LRR and PYD domains-containing protein 3
Synonyms:
C1orf7 NALP3 NLRP3 protein PYPAF1
Type:
Enzyme Catalytic Domain
Mol. Mass.:
118173.88
Organism:
Homo sapiens (Human)
Description:
Q96P20
Residue:
1036
  
Inhibitor
Name:
BDBM76262
Synonyms:
MLS000100198 N-(3-chlorophenyl)pyrazolo[1,5-a]pyrimidine-3-carboxamide cid_2226541
Type:
Small organic molecule
Emp. Form.:
C13H9ClN4O
Mol. Mass.:
272.69
SMILES:
Clc1cccc(NC(=O)c2cnn3cccnc23)c1
: