Target
Lysine-specific histone demethylase 1A
Ligand
BDBM270462
Substrate
Meas. Tech.
LSD1 enzymatic assay
pH
7.5±n/a
Temperature
298.15±n/a K
IC50
48.0±n/a nM
Comments
extracted
Citation
 Vaisburg, AMarx, MA LSD1 inhibitors US Patent  US10059668 Publication Date 8/28/2018 
Target
Name:
Lysine-specific histone demethylase 1A
Synonyms:
AOF2 Flavin-containing amine oxidase domain-containing protein 2 KDM1A KIAA0601 Lysine-specific demethylase 1 (LSD1) Lysine-specific histone demethylase 1 (LSD1)
Type:
Enzyme
Mol. Mass.:
92901.01
Organism:
Homo sapiens (Human)
Description:
O60341
Residue:
852
  
Inhibitor
Name:
BDBM270462
Synonyms:
US10059668, Example 25
Type:
Small organic molecule
Emp. Form.:
C29H33N3O3S
Mol. Mass.:
503.656
SMILES:
O=C(NS(=O)(=O)Cc1ccccc1)c1ccc(CN2CCC(CC2)N[C@@H]2C[C@H]2c2ccccc2)cc1
: