Target
Intestinal-type alkaline phosphatase
Ligand
BDBM57483
Substrate
Meas. Tech.
Dose Response concentration confirmation of uHTS hits from a small molecule activators of human intestinal alkaline phosphatase via a luminescent assay - Set 2
EC50
58100±n/a nM
Citation
 PubChem, PC Dose Response concentration confirmation of uHTS hits from a small molecule activators of human intestinal alkaline phosphatase via a luminescent assay - Set 2 PubChem Bioassay (2010)[AID] 
Target
Name:
Intestinal-type alkaline phosphatase
Synonyms:
ALPI Intestinal alkaline phosphatase | PPBI_HUMAN
Type:
PROTEIN
Mol. Mass.:
56804.94
Organism:
Homo sapiens (Human)
Description:
ChEMBL_1278525
Residue:
528
  
Inhibitor
Name:
BDBM57483
Synonyms:
MLS000581688 N-[4-[(isovalerylthiocarbamoylamino)carbamoyl]phenyl]cyclohexanecarboxamide N-{4-[(2-{[(3-methylbutanoyl)amino]carbonothioyl}hydrazino)carbonyl]phenyl}cyclohexanecarboxamide cid_2964264
Type:
Small organic molecule
Emp. Form.:
C20H28N4O3S
Mol. Mass.:
404.526
SMILES:
CC(C)CC(=O)NC(=S)NNC(=O)c1ccc(NC(=O)C2CCCCC2)cc1
: