Target
Intestinal-type alkaline phosphatase
Ligand
BDBM75668
Substrate
Meas. Tech.
Dose Response concentration confirmation of uHTS hits from a small molecule activators of human intestinal alkaline phosphatase via a luminescent assay - Set 2
EC50
9870±n/a nM
Citation
 PubChem, PC Dose Response concentration confirmation of uHTS hits from a small molecule activators of human intestinal alkaline phosphatase via a luminescent assay - Set 2 PubChem Bioassay (2010)[AID] 
Target
Name:
Intestinal-type alkaline phosphatase
Synonyms:
ALPI Intestinal alkaline phosphatase | PPBI_HUMAN
Type:
PROTEIN
Mol. Mass.:
56804.94
Organism:
Homo sapiens (Human)
Description:
ChEMBL_1278525
Residue:
528
  
Inhibitor
Name:
BDBM75668
Synonyms:
1-N',6-N'-bis(2-phenoxyacetyl)hexanedihydrazide N1',N6'-bis(1-oxo-2-phenoxyethyl)hexanedihydrazide N1',N6'-bis(2-phenoxyethanoyl)hexanedihydrazide The compound has not trivial name. | cid_3113773
Type:
Small organic molecule
Emp. Form.:
C22H26N4O6
Mol. Mass.:
442.465
SMILES:
O=C(CCCCC(=O)NNC(=O)COc1ccccc1)NNC(=O)COc1ccccc1
: