Target
Intestinal-type alkaline phosphatase
Ligand
BDBM75670
Substrate
Meas. Tech.
Dose Response concentration confirmation of uHTS hits from a small molecule activators of human intestinal alkaline phosphatase via a luminescent assay - Set 2
EC50
99000±n/a nM
Citation
 PubChem, PC Dose Response concentration confirmation of uHTS hits from a small molecule activators of human intestinal alkaline phosphatase via a luminescent assay - Set 2 PubChem Bioassay (2010)[AID] 
Target
Name:
Intestinal-type alkaline phosphatase
Synonyms:
ALPI Intestinal alkaline phosphatase | PPBI_HUMAN
Type:
PROTEIN
Mol. Mass.:
56804.94
Organism:
Homo sapiens (Human)
Description:
ChEMBL_1278525
Residue:
528
  
Inhibitor
Name:
BDBM75670
Synonyms:
2-(N-(3,5-dimethylisoxazol-4-yl)sulfonyl-4-methyl-anilino)-N-o-anisyl-acetamide 2-[N-[(3,5-dimethyl-1,2-oxazol-4-yl)sulfonyl]-4-methylanilino]-N-[(2-methoxyphenyl)methyl]acetamide MLS000912891 cid_16020025
Type:
Small organic molecule
Emp. Form.:
C22H25N3O5S
Mol. Mass.:
443.516
SMILES:
COc1ccccc1CNC(=O)CN(c1ccc(C)cc1)S(=O)(=O)c1c(C)noc1C
: