Target
Kappa-type opioid receptor
Ligand
BDBM71590
Substrate
Meas. Tech.
SAR analysis of Antagonists of the Kappa Opioid Receptor (KOR) using an Image-Based Assay - Set 3
IC50
264±n/a nM
Citation
 PubChem, PC SAR analysis of Antagonists of the Kappa Opioid Receptor (KOR) using an Image-Based Assay - Set 3 PubChem Bioassay (2010)[AID] 
Target
Name:
Kappa-type opioid receptor
Synonyms:
K-OR-1 Kappa-opioid receptor (KOR) Kappa-type opioid receptor (KOR) OPIATE Kappa OPRK1 kappa opioid receptor (KOR)
Type:
G Protein-Coupled Receptor (GPCR)
Mol. Mass.:
42648.76
Organism:
Homo sapiens (Human)
Description:
P41145
Residue:
380
  
Inhibitor
Name:
BDBM71590
Synonyms:
4-[[(4-ethylphenyl)sulfonylamino]methyl]-N-[2-[(4-methoxyphenyl)methyl-propan-2-yl-amino]ethyl]benzamide 4-[[(4-ethylphenyl)sulfonylamino]methyl]-N-[2-[isopropyl(p-anisyl)amino]ethyl]benzamide KUC104171N | cid_44620896
Type:
Small organic molecule
Emp. Form.:
C29H37N3O4S
Mol. Mass.:
523.687
SMILES:
CCc1ccc(cc1)S(=O)(=O)NCc1ccc(cc1)C(=O)NCCN(Cc1ccc(OC)cc1)C(C)C
: