Target
Kappa-type opioid receptor
Ligand
BDBM71602
Substrate
Meas. Tech.
SAR analysis of Antagonists of the Kappa Opioid Receptor (KOR) using an Image-Based Assay - Set 3
IC50
>32000±n/a nM
Citation
 PubChem, PC SAR analysis of Antagonists of the Kappa Opioid Receptor (KOR) using an Image-Based Assay - Set 3 PubChem Bioassay (2010)[AID] 
Target
Name:
Kappa-type opioid receptor
Synonyms:
K-OR-1 Kappa-opioid receptor (KOR) Kappa-type opioid receptor (KOR) OPIATE Kappa OPRK1 kappa opioid receptor (KOR)
Type:
G Protein-Coupled Receptor (GPCR)
Mol. Mass.:
42648.76
Organism:
Homo sapiens (Human)
Description:
P41145
Residue:
380
  
Inhibitor
Name:
BDBM71602
Synonyms:
KSC-1-185 cid_22553452
Type:
Small organic molecule
Emp. Form.:
C25H27ClN6O2
Mol. Mass.:
478.974
SMILES:
Cc1ccc(Cl)cc1N1CCN(CCNC(=O)Cn2c3ncccc3n3cccc3c2=O)CC1
: