Target
Kappa-type opioid receptor
Ligand
BDBM75384
Substrate
Meas. Tech.
SAR analysis of Agonists of the Kappa Opioid Receptor (KOR) using an Image-Based Assay-Set 3
EC50
5290±n/a nM
Citation
 PubChem, PC SAR analysis of Agonists of the Kappa Opioid Receptor (KOR) using an Image-Based Assay-Set 3 PubChem Bioassay (2010)[AID] 
Target
Name:
Kappa-type opioid receptor
Synonyms:
K-OR-1 Kappa-opioid receptor (KOR) Kappa-type opioid receptor (KOR) OPIATE Kappa OPRK1 kappa opioid receptor (KOR)
Type:
G Protein-Coupled Receptor (GPCR)
Mol. Mass.:
42648.76
Organism:
Homo sapiens (Human)
Description:
P41145
Residue:
380
  
Inhibitor
Name:
BDBM75384
Synonyms:
2-[4-(2-furanylmethyl)-5-[(2,3,4-trifluorophenyl)methylthio]-1,2,4-triazol-3-yl]pyridine 2-[4-(furan-2-ylmethyl)-5-[(2,3,4-trifluorophenyl)methylsulfanyl]-1,2,4-triazol-3-yl]pyridine KSC-5-287B12 cid_44620919
Type:
Small organic molecule
Emp. Form.:
C19H13F3N4OS
Mol. Mass.:
402.393
SMILES:
Fc1ccc(CSc2nnc(-c3ccccn3)n2Cc2ccco2)c(F)c1F
: