Target
cAMP-dependent protein kinase catalytic subunit alpha
Ligand
BDBM2588
Substrate
Lysine-rich histone
Meas. Tech.
PKC assay
pH
7.4±n/a
Temperature
303.15±n/a K
IC50
>50000±n/a nM
Citation
 Toullec, DPianetti, PCoste, HBellevergue, PGrand-Perret, TAjakane, MBaudet, VBoissin, PBoursier, ELoriolle, F The bisindolylmaleimide GF 109203X is a potent and selective inhibitor of protein kinase C. J Biol Chem 266:15771-81 (1991) Target
Name:
cAMP-dependent protein kinase catalytic subunit alpha
Synonyms:
KAPCA_BOVIN PKC Protein Kinase C cAMP-Dependent Protein Kinase (PKA) cAMP-dependent protein kinase A cAMP-dependent protein kinase, alpha-catalytic subunit
Type:
Enzyme Complex
Mol. Mass.:
40627.77
Organism:
Bos taurus (bovine)
Description:
The PKA holoenzyme purified from bovine heart, exists as an inactive tetrameric complex, which consists of a regulatory dimer associated with two catalytic subunits. It requires cAMP to activate the enzymatic reaction.
Residue:
351
  
Inhibitor
Name:
BDBM2588
Synonyms:
3,4-bis(1H-indol-3-yl)-2,5-dihydrofuran-2,5-dione Bisindolylmaleimide deriv. 10
Type:
Small organic molecule
Emp. Form.:
C20H12N2O3
Mol. Mass.:
328.3209
SMILES:
O=C1OC(=O)C(=C1c1c[nH]c2ccccc12)c1c[nH]c2ccccc12
:
Substrate
Name:
Lysine-rich histone
Synonyms:
ING Peptide histone type IIIS
Type:
Peptide
Mol. Mass.:
10508.21
Organism:
Bos taurus (bovine)
Description:
Purified as a lysine rich fraction of histone H1 from calf thymus.
Residue:
105