Target
cAMP-dependent protein kinase catalytic subunit alpha
Ligand
BDBM2688
Substrate
histone (type H IIas)
Meas. Tech.
PKA assay
IC50
4500±n/a nM
Citation
 Toullec, DPianetti, PCoste, HBellevergue, PGrand-Perret, TAjakane, MBaudet, VBoissin, PBoursier, ELoriolle, F The bisindolylmaleimide GF 109203X is a potent and selective inhibitor of protein kinase C. J Biol Chem 266:15771-81 (1991) Target
Name:
cAMP-dependent protein kinase catalytic subunit alpha
Synonyms:
KAPCA_RAT Prkaca cAMP-dependent protein kinase alpha-catalytic subunit
Type:
Enzyme catalytic subunit
Mol. Mass.:
40627.70
Organism:
Rattus norvegicus (rat)
Description:
The catalytic subunit of cAMP-dependent protein kinase (PKA) was used in the assay. It did not require cAMP for activity.
Residue:
351
  
Inhibitor
Name:
BDBM2688
Synonyms:
3-(1H-indol-3-yl)-4-[1-(2-methoxyethyl)-1H-indol-3-yl]-2,5-dihydro-1H-pyrrole-2,5-dione | Bisindolyl deriv. 14
Type:
Small organic molecule
Emp. Form.:
C23H19N3O3
Mol. Mass.:
385.4153
SMILES:
COCCn1cc(C2=C(C(=O)NC2=O)c2c[nH]c3ccccc23)c2ccccc12
:
Substrate
Name:
histone (type H IIas)
Synonyms:
Type:
Peptide
Mol. Mass.:
13378.65
Organism:
Description:
20 uM [gamma-32P]ATP as co-substrate.
Residue:
124