Target
Mu-type opioid receptor
Ligand
BDBM75404
Substrate
Meas. Tech.
SAR Analysis of Antagonists of the MOR Receptor using an Image-Based Assay - Set 3
IC50
15000±n/a nM
Citation
 PubChem, PC SAR Analysis of Antagonists of the MOR Receptor using an Image-Based Assay - Set 3 PubChem Bioassay (2010)[AID] 
Target
Name:
Mu-type opioid receptor
Synonyms:
M-OR-1 MOR-1 MUOR1 Mu opiate receptor OPRM1 hMOP | mu-type opioid receptor isoform MOR-1
Type:
G Protein-Coupled Receptor (GPCR)
Mol. Mass.:
44789.51
Organism:
Homo sapiens (Human)
Description:
P35372
Residue:
400
  
Inhibitor
Name:
BDBM75404
Synonyms:
1-[2-furanylmethyl-[oxo(2-pyridinyl)methyl]amino]-1-cyclohexanecarboxylic acid propan-2-yl ester KSC-12-15B cid_44665689 propan-2-yl 1-[furan-2-ylmethyl(pyridine-2-carbonyl)amino]cyclohexane-1-carboxylate
Type:
Small organic molecule
Emp. Form.:
C21H26N2O4
Mol. Mass.:
370.4421
SMILES:
CC(C)OC(=O)C1(CCCCC1)N(Cc1ccco1)C(=O)c1ccccn1
: