Target
NACHT, LRR and PYD domains-containing protein 1
Ligand
BDBM76313
Substrate
Meas. Tech.
Dose Response confirmation of uHTS for the identification of inhibitors of NALP1 in yeast using a luminescent assay
IC50
40000±n/a nM
Citation
 PubChem, PC Dose Response confirmation of uHTS for the identification of inhibitors of NALP1 in yeast using a luminescent assay PubChem Bioassay (2010)[AID] 
Target
Name:
NACHT, LRR and PYD domains-containing protein 1
Synonyms:
CARD7 KIAA0926 NACHT, LRR and PYD domains-containing protein 1 isoform 1 NLRP1 | NLRP1_HUMAN
Type:
Enzyme Catalytic Domain
Mol. Mass.:
165873.33
Organism:
Homo sapiens (Human)
Description:
Q9C000
Residue:
1473
  
Inhibitor
Name:
BDBM76313
Synonyms:
4-(2,4-dichlorophenoxy)-N-isopropyl-butyramide 4-(2,4-dichlorophenoxy)-N-propan-2-ylbutanamide MLS000532067 cid_2057520
Type:
Small organic molecule
Emp. Form.:
C13H17Cl2NO2
Mol. Mass.:
290.186
SMILES:
CC(C)NC(=O)CCCOc1ccc(Cl)cc1Cl
: