Target
NACHT, LRR and PYD domains-containing protein 1
Ligand
BDBM76316
Substrate
Meas. Tech.
Dose Response confirmation of uHTS for the identification of inhibitors of NALP1 in yeast using a luminescent assay
IC50
18300±n/a nM
Citation
 PubChem, PC Dose Response confirmation of uHTS for the identification of inhibitors of NALP1 in yeast using a luminescent assay PubChem Bioassay (2010)[AID] 
Target
Name:
NACHT, LRR and PYD domains-containing protein 1
Synonyms:
CARD7 KIAA0926 NACHT, LRR and PYD domains-containing protein 1 isoform 1 NLRP1 | NLRP1_HUMAN
Type:
Enzyme Catalytic Domain
Mol. Mass.:
165873.33
Organism:
Homo sapiens (Human)
Description:
Q9C000
Residue:
1473
  
Inhibitor
Name:
BDBM76316
Synonyms:
2,4-bis(chloranyl)-N-(4-pyrrol-1-ylphenyl)benzenesulfonamide 2,4-dichloro-N-[4-(1-pyrrolyl)phenyl]benzenesulfonamide MLS000549261 cid_2768244
Type:
Small organic molecule
Emp. Form.:
C16H12Cl2N2O2S
Mol. Mass.:
367.25
SMILES:
Clc1ccc(c(Cl)c1)S(=O)(=O)Nc1ccc(cc1)-n1cccc1
: