Target
NACHT, LRR and PYD domains-containing protein 1
Ligand
BDBM52505
Substrate
Meas. Tech.
Dose Response confirmation of uHTS for the identification of inhibitors of NALP1 in yeast using a luminescent assay
IC50
>100000±n/a nM
Citation
 PubChem, PC Dose Response confirmation of uHTS for the identification of inhibitors of NALP1 in yeast using a luminescent assay PubChem Bioassay (2010)[AID] 
Target
Name:
NACHT, LRR and PYD domains-containing protein 1
Synonyms:
CARD7 KIAA0926 NACHT, LRR and PYD domains-containing protein 1 isoform 1 NLRP1 | NLRP1_HUMAN
Type:
Enzyme Catalytic Domain
Mol. Mass.:
165873.33
Organism:
Homo sapiens (Human)
Description:
Q9C000
Residue:
1473
  
Inhibitor
Name:
BDBM52505
Synonyms:
1H-imidazo[4,5-b]phenazine SMR000226252 | cid_5998849
Type:
Small organic molecule
Emp. Form.:
C13H8N4
Mol. Mass.:
220.2294
SMILES:
c1nc2cc3nc4ccccc4nc3cc2[nH]1
: