Target
NACHT, LRR and PYD domains-containing protein 1
Ligand
BDBM76327
Substrate
Meas. Tech.
Dose Response confirmation of uHTS for the identification of inhibitors of NALP1 in yeast using a luminescent assay
IC50
>100000±n/a nM
Citation
 PubChem, PC Dose Response confirmation of uHTS for the identification of inhibitors of NALP1 in yeast using a luminescent assay PubChem Bioassay (2010)[AID] 
Target
Name:
NACHT, LRR and PYD domains-containing protein 1
Synonyms:
CARD7 KIAA0926 NACHT, LRR and PYD domains-containing protein 1 isoform 1 NLRP1 | NLRP1_HUMAN
Type:
Enzyme Catalytic Domain
Mol. Mass.:
165873.33
Organism:
Homo sapiens (Human)
Description:
Q9C000
Residue:
1473
  
Inhibitor
Name:
BDBM76327
Synonyms:
4-[4-(2-bromanyl-6-chloranyl-4-methyl-phenoxy)butyl]morpholine 4-[4-(2-bromo-6-chloro-4-methylphenoxy)butyl]morpholine SMR000271351 | cid_2299958
Type:
Small organic molecule
Emp. Form.:
C15H21BrClNO2
Mol. Mass.:
362.69
SMILES:
Cc1cc(Cl)c(OCCCCN2CCOCC2)c(Br)c1
: