Target
Caspase-1
Ligand
BDBM76308
Substrate
Meas. Tech.
Dose Response confirmation of inhibitors of NALP1 in yeast using a Caspase-1-ASC counter screen.
IC50
56900±n/a nM
Citation
 PubChem, PC Dose Response confirmation of inhibitors of NALP1 in yeast using a Caspase-1-ASC counter screen. PubChem Bioassay (2010)[AID] 
Target
Name:
Caspase-1
Synonyms:
CASP1 Caspase ICE IL1BCE Interleukin-1 beta-converting enzyme
Type:
Enzyme
Mol. Mass.:
45154.13
Organism:
Homo sapiens (Human)
Description:
P29466
Residue:
404
  
Inhibitor
Name:
BDBM76308
Synonyms:
(5-methyl-2-pyridin-4-yl-1,3-thiazol-4-yl) benzoate MLS000539860 benzoic acid (5-methyl-2-pyridin-4-yl-4-thiazolyl) ester cid_4353060
Type:
Small organic molecule
Emp. Form.:
C16H12N2O2S
Mol. Mass.:
296.344
SMILES:
Cc1sc(nc1OC(=O)c1ccccc1)-c1ccncc1
: