Target
Caspase-1
Ligand
BDBM76319
Substrate
Meas. Tech.
Dose Response confirmation of inhibitors of NALP1 in yeast using a Caspase-1-ASC counter screen.
IC50
49100±n/a nM
Citation
 PubChem, PC Dose Response confirmation of inhibitors of NALP1 in yeast using a Caspase-1-ASC counter screen. PubChem Bioassay (2010)[AID] 
Target
Name:
Caspase-1
Synonyms:
CASP1 Caspase ICE IL1BCE Interleukin-1 beta-converting enzyme
Type:
Enzyme
Mol. Mass.:
45154.13
Organism:
Homo sapiens (Human)
Description:
P29466
Residue:
404
  
Inhibitor
Name:
BDBM76319
Synonyms:
(5Z)-3-(1,1-diketothiolan-3-yl)-5-(3-pyridylmethylene)-2-thioxo-thiazolidin-4-one (5Z)-3-(1,1-dioxothiolan-3-yl)-5-(pyridin-3-ylmethylidene)-2-sulfanylidene-1,3-thiazolidin-4-one 3-(1,1-Dioxo-tetrahydro-1lambda*6*-thiophen-3-yl)-5-[1-pyridin-3-yl-meth-(Z)-ylidene]-2-thioxo-thiazolidin-4-one SMR000212146 | cid_5780532
Type:
Small organic molecule
Emp. Form.:
C13H12N2O3S3
Mol. Mass.:
340.441
SMILES:
O=C1N(C2CCS(=O)(=O)C2)C(=S)S\C1=C/c1cccnc1
: