Target
Caspase-1
Ligand
BDBM71174
Substrate
Meas. Tech.
Dose Response confirmation of inhibitors of NALP1 in yeast using a Caspase-1-ASC counter screen.
IC50
72300±n/a nM
Citation
 PubChem, PC Dose Response confirmation of inhibitors of NALP1 in yeast using a Caspase-1-ASC counter screen. PubChem Bioassay (2010)[AID] 
Target
Name:
Caspase-1
Synonyms:
CASP1 Caspase ICE IL1BCE Interleukin-1 beta-converting enzyme
Type:
Enzyme
Mol. Mass.:
45154.13
Organism:
Homo sapiens (Human)
Description:
P29466
Residue:
404
  
Inhibitor
Name:
BDBM71174
Synonyms:
4-(1-benzimidazolyl)-1-methyl-3-nitro-2-quinolinone 4-(benzimidazol-1-yl)-1-methyl-3-nitro-quinolin-2-one 4-Benzoimidazol-1-yl-1-methyl-3-nitro-1H-quinolin-2-one SMR000424894 | cid_769909
Type:
Small organic molecule
Emp. Form.:
C17H12N4O3
Mol. Mass.:
320.3022
SMILES:
Cn1c2ccccc2c(c([N+]([O-])=O)c1=O)-n1cnc2ccccc12
: