Target
Type-1 angiotensin II receptor
Ligand
BDBM76102
Substrate
Meas. Tech.
Dose Response screen for agonists of Angiotensin II Receptor Type 1 to assess selectivity of uHTS small molecule agonists hits of the APJ receptor
EC50
>100000±n/a nM
Citation
 PubChem, PC Dose Response screen for agonists of Angiotensin II Receptor Type 1 to assess selectivity of uHTS small molecule agonists hits of the APJ receptor PubChem Bioassay (2010)[AID] 
Target
Name:
Type-1 angiotensin II receptor
Synonyms:
AGTR1 AGTR1B AT1 AT1BR AT2R1B Angiotensin II receptor Type-1 angiotensin II receptor (AT1)
Type:
Protein
Mol. Mass.:
41080.75
Organism:
Homo sapiens (Human)
Description:
P30556
Residue:
359
  
Inhibitor
Name:
BDBM76102
Synonyms:
6-Methoxy-3-{[{1-[1-(2-methoxy-ethyl)-1H-tetrazol-5-yl]-propyl}-(4-methyl-benzyl)-amino]-methyl}-1H-quinolin-2-one 6-methoxy-3-[[1-[1-(2-methoxyethyl)-5-tetrazolyl]propyl-[(4-methylphenyl)methyl]amino]methyl]-1H-quinolin-2-one 6-methoxy-3-[[1-[1-(2-methoxyethyl)tetrazol-5-yl]propyl-[(4-methylphenyl)methyl]amino]methyl]-1H-quinolin-2-one SMR000004380 | cid_652804
Type:
Small organic molecule
Emp. Form.:
C26H32N6O3
Mol. Mass.:
476.5707
SMILES:
CCC(N(Cc1ccc(C)cc1)Cc1cc2cc(OC)ccc2[nH]c1=O)c1nnnn1CCOC
: