Target
Type-1 angiotensin II receptor
Ligand
BDBM70670
Substrate
Meas. Tech.
Dose Response screen for agonists of Angiotensin II Receptor Type 1 to assess selectivity of uHTS small molecule agonists hits of the APJ receptor
EC50
>100000±n/a nM
Citation
 PubChem, PC Dose Response screen for agonists of Angiotensin II Receptor Type 1 to assess selectivity of uHTS small molecule agonists hits of the APJ receptor PubChem Bioassay (2010)[AID] 
Target
Name:
Type-1 angiotensin II receptor
Synonyms:
AGTR1 AGTR1B AT1 AT1BR AT2R1B Angiotensin II receptor Type-1 angiotensin II receptor (AT1)
Type:
Protein
Mol. Mass.:
41080.75
Organism:
Homo sapiens (Human)
Description:
P30556
Residue:
359
  
Inhibitor
Name:
BDBM70670
Synonyms:
(Z)-2-(6-methyl-1H-benzimidazol-2-yl)-3-(5-nitro-2-furanyl)-2-propenenitrile (Z)-2-(6-methyl-1H-benzimidazol-2-yl)-3-(5-nitrofuran-2-yl)prop-2-enenitrile MLS000560281 cid_5341736
Type:
Small organic molecule
Emp. Form.:
C15H10N4O3
Mol. Mass.:
294.2649
SMILES:
Cc1ccc2nc([nH]c2c1)C(=Cc1ccc(o1)[N+]([O-])=O)C#N
: