Target
Type-1 angiotensin II receptor
Ligand
BDBM76135
Substrate
Meas. Tech.
Dose Response screen for agonists of Angiotensin II Receptor Type 1 to assess selectivity of uHTS small molecule agonists hits of the APJ receptor
EC50
>100000±n/a nM
Citation
 PubChem, PC Dose Response screen for agonists of Angiotensin II Receptor Type 1 to assess selectivity of uHTS small molecule agonists hits of the APJ receptor PubChem Bioassay (2010)[AID] 
Target
Name:
Type-1 angiotensin II receptor
Synonyms:
AGTR1 AGTR1B AT1 AT1BR AT2R1B Angiotensin II receptor Type-1 angiotensin II receptor (AT1)
Type:
Protein
Mol. Mass.:
41080.75
Organism:
Homo sapiens (Human)
Description:
P30556
Residue:
359
  
Inhibitor
Name:
BDBM76135
Synonyms:
MLS001030861 N-[2-(diethylamino)ethyl]-6-(4-methylpiperidin-1-yl)sulfonyl-2-pyridin-3-ylquinoline-4-carboxamide N-[2-(diethylamino)ethyl]-6-[(4-methyl-1-piperidinyl)sulfonyl]-2-(3-pyridinyl)-4-quinolinecarboxamide cid_20968585
Type:
Small organic molecule
Emp. Form.:
C27H35N5O3S
Mol. Mass.:
509.664
SMILES:
CCN(CC)CCNC(=O)c1cc(nc2ccc(cc12)S(=O)(=O)N1CCC(C)CC1)-c1cccnc1
: