Target
Intestinal-type alkaline phosphatase
Ligand
BDBM48826
Substrate
Meas. Tech.
Dose Response confirmation of uHTS activators of Mouse Intestinal Alkaline Phosphatase using Human Intestinal Alkaline Phosphatase
EC50
>100000±n/a nM
Citation
 PubChem, PC Dose Response confirmation of uHTS activators of Mouse Intestinal Alkaline Phosphatase using Human Intestinal Alkaline Phosphatase PubChem Bioassay (2010)[AID] 
Target
Name:
Intestinal-type alkaline phosphatase
Synonyms:
ALPI Intestinal alkaline phosphatase | PPBI_HUMAN
Type:
PROTEIN
Mol. Mass.:
56804.94
Organism:
Homo sapiens (Human)
Description:
ChEMBL_1278525
Residue:
528
  
Inhibitor
Name:
BDBM48826
Synonyms:
8-acetyl-3a,4,5,9b-tetrahydro-3H-cyclopenta[c]quinoline-4-carboxylic acid MLS000713690 US11584714, Compound 30 | cid_3136298
Type:
Small organic molecule
Emp. Form.:
C15H15NO3
Mol. Mass.:
257.2845
SMILES:
CC(=O)c1ccc2NC(C3CC=CC3c2c1)C(O)=O
: