Target
Intestinal-type alkaline phosphatase 1
Ligand
BDBM75625
Substrate
Meas. Tech.
Dose Response confirmation of uHTS inhibitors of Human Intestinal Alkaline Phosphatase using Mouse Intestinal Alkaline Phosphatase
IC50
50400±n/a nM
Citation
 PubChem, PC Dose Response confirmation of uHTS inhibitors of Human Intestinal Alkaline Phosphatase using Mouse Intestinal Alkaline Phosphatase PubChem Bioassay (2010)[AID] 
Target
Name:
Intestinal-type alkaline phosphatase 1
Synonyms:
Alpi | PPBI1_RAT
Type:
Enzyme Catalytic Domain
Mol. Mass.:
58396.39
Organism:
Rattus norvegicus (Rat)
Description:
P15693
Residue:
540
  
Inhibitor
Name:
BDBM75625
Synonyms:
MLS000582492 N-(3-methylbutyl)-4-[2-(2-methyl-[1,2,4]triazolo[1,5-c]quinazolin-5-yl)hydrazinyl]-4-oxidanylidene-butanamide N-(3-methylbutyl)-4-[2-(2-methyl[1,2,4]triazolo[1,5-c]quinazolin-5-yl)hydrazino]-4-oxobutanamide SMR000206478 | cid_12004910
Type:
Small organic molecule
Emp. Form.:
C19H25N7O2
Mol. Mass.:
383.4475
SMILES:
CC(C)CCNC(=O)CCC(=O)NNc1nc2ccccc2c2nc(C)nn12
: