Target
Intestinal-type alkaline phosphatase 1
Ligand
BDBM65289
Substrate
Meas. Tech.
Dose Response confirmation of uHTS inhibitors of Human Intestinal Alkaline Phosphatase using Mouse Intestinal Alkaline Phosphatase
IC50
70400±n/a nM
Citation
 PubChem, PC Dose Response confirmation of uHTS inhibitors of Human Intestinal Alkaline Phosphatase using Mouse Intestinal Alkaline Phosphatase PubChem Bioassay (2010)[AID] 
Target
Name:
Intestinal-type alkaline phosphatase 1
Synonyms:
Alpi | PPBI1_RAT
Type:
Enzyme Catalytic Domain
Mol. Mass.:
58396.39
Organism:
Rattus norvegicus (Rat)
Description:
P15693
Residue:
540
  
Inhibitor
Name:
BDBM65289
Synonyms:
(E)-N-[(salicyloylamino)thiocarbamoyl]-3-(2-thienyl)acrylamide (E)-N-[[(2-hydroxyphenyl)carbonylamino]carbamothioyl]-3-thiophen-2-yl-prop-2-enamide MLS000703259 cid_5763840
Type:
Small organic molecule
Emp. Form.:
C15H13N3O3S2
Mol. Mass.:
347.412
SMILES:
Oc1ccccc1C(=O)NNC(=S)NC(=O)\C=C\c1cccs1
: