Target
Intestinal-type alkaline phosphatase 1
Ligand
BDBM75656
Substrate
Meas. Tech.
Dose Response confirmation of uHTS inhibitors of Human Intestinal Alkaline Phosphatase using Mouse Intestinal Alkaline Phosphatase
IC50
35500±n/a nM
Citation
 PubChem, PC Dose Response confirmation of uHTS inhibitors of Human Intestinal Alkaline Phosphatase using Mouse Intestinal Alkaline Phosphatase PubChem Bioassay (2010)[AID] 
Target
Name:
Intestinal-type alkaline phosphatase 1
Synonyms:
Alpi | PPBI1_RAT
Type:
Enzyme Catalytic Domain
Mol. Mass.:
58396.39
Organism:
Rattus norvegicus (Rat)
Description:
P15693
Residue:
540
  
Inhibitor
Name:
BDBM75656
Synonyms:
(3Z)-5-(hydroxyamino)-6-nitroso-3-phenacylidene-1,4-dihydropyrazin-2-one MLS001164264 cid_5904198
Type:
Small organic molecule
Emp. Form.:
C12H10N4O4
Mol. Mass.:
274.2322
SMILES:
ONc1nc(CC(=O)c2ccccc2)c(=O)[nH]c1N=O
: