Target
Intestinal-type alkaline phosphatase 1
Ligand
BDBM53236
Substrate
Meas. Tech.
Dose Response confirmation of uHTS inhibitors of Human Intestinal Alkaline Phosphatase using Mouse Intestinal Alkaline Phosphatase
IC50
64200±n/a nM
Citation
 PubChem, PC Dose Response confirmation of uHTS inhibitors of Human Intestinal Alkaline Phosphatase using Mouse Intestinal Alkaline Phosphatase PubChem Bioassay (2010)[AID] 
Target
Name:
Intestinal-type alkaline phosphatase 1
Synonyms:
Alpi | PPBI1_RAT
Type:
Enzyme Catalytic Domain
Mol. Mass.:
58396.39
Organism:
Rattus norvegicus (Rat)
Description:
P15693
Residue:
540
  
Inhibitor
Name:
BDBM53236
Synonyms:
4-(3-methyl-1-piperidinyl)-N'-(2-methyl-[1,2,4]triazolo[1,5-c]quinazolin-5-yl)-4-oxobutanehydrazide 4-(3-methylpiperidin-1-yl)-N'-(2-methyl-[1,2,4]triazolo[1,5-c]quinazolin-5-yl)-4-oxobutanehydrazide MLS000924775 cid_24789604
Type:
Small organic molecule
Emp. Form.:
C20H25N7O2
Mol. Mass.:
395.4582
SMILES:
CC1CCCN(C1)C(=O)CCC(=O)NNc1nc2ccccc2c2nc(C)nn12
: