Target
Lysine-specific demethylase 4C
Ligand
BDBM270501
Substrate
Meas. Tech.
JMJD2C Assay
IC50
550±n/a nM
Citation
 Chen, YKWallace, MB Histone demethylase inhibitors US Patent  US10059687 Publication Date 8/28/2018 
Target
Name:
Lysine-specific demethylase 4C
Synonyms:
GASC-1 protein Gene amplified in squamous cell carcinoma 1 protein JMJD2C Jumonji domain-containing protein 2C KDM4C_HUMAN | KIAA0780
Type:
Protein
Mol. Mass.:
119979.01
Organism:
Homo sapiens (Human)
Description:
Q9H3R0
Residue:
1056
  
Inhibitor
Name:
BDBM270501
Synonyms:
3-[({(1R)-6-[4-(cyclopropyl-methoxy)-2-methylphenyl]-1,2,3,4-tetrahydro-isoquinolyl}methyl) amino]pyridine-4-carboxylic acid US11001568, Example 4B | US11731954, Example 4B
Type:
Small organic molecule
Emp. Form.:
C27H29N3O3
Mol. Mass.:
443.5375
SMILES:
Cc1cc(OCC2CC2)ccc1-c1ccc2[C@H](CNc3cnccc3C(O)=O)NCCc2c1
: