Target
Lysine-specific demethylase 4C
Ligand
BDBM270516
Substrate
Meas. Tech.
JMJD2C Assay
IC50
5500±n/a nM
Citation
 Chen, YKWallace, MB Histone demethylase inhibitors US Patent  US10059687 Publication Date 8/28/2018 
Target
Name:
Lysine-specific demethylase 4C
Synonyms:
GASC-1 protein Gene amplified in squamous cell carcinoma 1 protein JMJD2C Jumonji domain-containing protein 2C KDM4C_HUMAN | KIAA0780
Type:
Protein
Mol. Mass.:
119979.01
Organism:
Homo sapiens (Human)
Description:
Q9H3R0
Residue:
1056
  
Inhibitor
Name:
BDBM270516
Synonyms:
(R)-3-(((2-methyl-6-(o-tolyl)-1,2,3,4-tetrahydroiso-quinolin-1-yl)methyl)amino)isonicotinic acid US11001568, Example 12A | US11731954, Example 12A and 12B
Type:
Small organic molecule
Emp. Form.:
C24H25N3O2
Mol. Mass.:
387.4742
SMILES:
CN1CCc2cc(ccc2[C@@H]1CNc1cnccc1C(O)=O)-c1ccccc1C
: