Target
Lysine-specific demethylase 4C
Ligand
BDBM270518
Substrate
Meas. Tech.
JMJD2C Assay
IC50
550±n/a nM
Citation
 Chen, YKWallace, MB Histone demethylase inhibitors US Patent  US10059687 Publication Date 8/28/2018 
Target
Name:
Lysine-specific demethylase 4C
Synonyms:
GASC-1 protein Gene amplified in squamous cell carcinoma 1 protein JMJD2C Jumonji domain-containing protein 2C KDM4C_HUMAN | KIAA0780
Type:
Protein
Mol. Mass.:
119979.01
Organism:
Homo sapiens (Human)
Description:
Q9H3R0
Residue:
1056
  
Inhibitor
Name:
BDBM270518
Synonyms:
(R)-3-(((6-((4-ethylphenyl)(methyl)amino)-2-methyl-1,2,3,4-tetrahydroisoquinolin-1-yl)methyl)amino)isonico-tinic acid US11001568, Example 13A | US11731954, Example 13A and 13B
Type:
Small organic molecule
Emp. Form.:
C26H30N4O2
Mol. Mass.:
430.542
SMILES:
CCc1ccc(cc1)N(C)c1ccc2[C@H](CNc3cnccc3C(O)=O)N(C)CCc2c1
: