Target
Lysine-specific demethylase 5B
Ligand
BDBM270528
Substrate
Meas. Tech.
Jarid1B Assay
IC50
<100±n/a nM
Citation
 Chen, YKWallace, MB Histone demethylase inhibitors US Patent  US10059687 Publication Date 8/28/2018 
Target
Name:
Lysine-specific demethylase 5B
Synonyms:
CT31 Histone demethylase JARID1B Jumonji/ARID domain-containing protein 1B KDM5B_HUMAN Lysine-specific demethylase 5B (KDM5Flag-5B-FL) PLU1 RBP2-H1 | Retinoblastoma-binding protein 2 homolog 1
Type:
Protein
Mol. Mass.:
175659.67
Organism:
Homo sapiens (Human)
Description:
Q9UGL1
Residue:
1544
  
Inhibitor
Name:
BDBM270528
Synonyms:
(R)-3-(((2-methyl-5-(methyl(p-tolyl)amino)iso-indolin-1-yl)methyl)amino)isonicotinic acid US11001568, Example 18A | US11731954, Example 18A and 18B
Type:
Small organic molecule
Emp. Form.:
C24H26N4O2
Mol. Mass.:
402.4888
SMILES:
CN(c1ccc(C)cc1)c1ccc2[C@H](CNc3cnccc3C(O)=O)N(C)Cc2c1
: