Target
Intestinal-type alkaline phosphatase
Ligand
BDBM33720
Substrate
Meas. Tech.
Dose Response confirmation of uHTS inhibitors of Mouse Intestinal Alkaline Phosphatase using Human Intestinal Alkaline Phosphatase
IC50
>100000±n/a nM
Citation
 PubChem, PC Dose Response confirmation of uHTS inhibitors of Mouse Intestinal Alkaline Phosphatase using Human Intestinal Alkaline Phosphatase PubChem Bioassay (2010)[AID] 
Target
Name:
Intestinal-type alkaline phosphatase
Synonyms:
ALPI Intestinal alkaline phosphatase | PPBI_HUMAN
Type:
PROTEIN
Mol. Mass.:
56804.94
Organism:
Homo sapiens (Human)
Description:
ChEMBL_1278525
Residue:
528
  
Inhibitor
Name:
BDBM33720
Synonyms:
1-(3,3-diphenylpropyl)-3-(3-methoxyphenyl)thiourea N-(3,3-diphenylpropyl)-N'-(3-methoxyphenyl)thiourea cid_1322053
Type:
Small organic molecule
Emp. Form.:
C23H24N2OS
Mol. Mass.:
376.514
SMILES:
COc1cccc(NC(=S)NCCC(c2ccccc2)c2ccccc2)c1
: