Target
Intestinal-type alkaline phosphatase
Ligand
BDBM76174
Substrate
Meas. Tech.
Dose Response confirmation of uHTS inhibitors of Mouse Intestinal Alkaline Phosphatase using Human Intestinal Alkaline Phosphatase
IC50
>100000±n/a nM
Citation
 PubChem, PC Dose Response confirmation of uHTS inhibitors of Mouse Intestinal Alkaline Phosphatase using Human Intestinal Alkaline Phosphatase PubChem Bioassay (2010)[AID] 
Target
Name:
Intestinal-type alkaline phosphatase
Synonyms:
ALPI Intestinal alkaline phosphatase | PPBI_HUMAN
Type:
PROTEIN
Mol. Mass.:
56804.94
Organism:
Homo sapiens (Human)
Description:
ChEMBL_1278525
Residue:
528
  
Inhibitor
Name:
BDBM76174
Synonyms:
1-(3,5-dimethoxyphenyl)-3-(3,3-diphenylpropyl)thiourea N-(3,5-dimethoxyphenyl)-N'-(3,3-diphenylpropyl)thiourea cid_1323304
Type:
Small organic molecule
Emp. Form.:
C24H26N2O2S
Mol. Mass.:
406.54
SMILES:
COc1cc(NC(=S)NCCC(c2ccccc2)c2ccccc2)cc(OC)c1
: