Target
Intestinal-type alkaline phosphatase
Ligand
BDBM76190
Substrate
Meas. Tech.
Dose Response confirmation of uHTS inhibitors of Mouse Intestinal Alkaline Phosphatase using Human Intestinal Alkaline Phosphatase
IC50
>100000±n/a nM
Citation
 PubChem, PC Dose Response confirmation of uHTS inhibitors of Mouse Intestinal Alkaline Phosphatase using Human Intestinal Alkaline Phosphatase PubChem Bioassay (2010)[AID] 
Target
Name:
Intestinal-type alkaline phosphatase
Synonyms:
ALPI Intestinal alkaline phosphatase | PPBI_HUMAN
Type:
PROTEIN
Mol. Mass.:
56804.94
Organism:
Homo sapiens (Human)
Description:
ChEMBL_1278525
Residue:
528
  
Inhibitor
Name:
BDBM76190
Synonyms:
(4E)-1-(3-bromophenyl)-4-[[5-(2-hydroxy-5-nitro-phenyl)-2-furyl]methylene]pyrazolidine-3,5-quinone (4E)-1-(3-bromophenyl)-4-[[5-(2-hydroxy-5-nitrophenyl)furan-2-yl]methylidene]pyrazolidine-3,5-dione MLS000713922 cid_2261970
Type:
Small organic molecule
Emp. Form.:
C20H12BrN3O6
Mol. Mass.:
470.23
SMILES:
Oc1ccc(cc1-c1ccc(\C=C2/C(=O)NN(C2=O)c2cccc(Br)c2)o1)[N+]([O-])=O
: