Target
Intestinal-type alkaline phosphatase
Ligand
BDBM76192
Substrate
Meas. Tech.
Dose Response confirmation of uHTS inhibitors of Mouse Intestinal Alkaline Phosphatase using Human Intestinal Alkaline Phosphatase
IC50
>100000±n/a nM
Citation
 PubChem, PC Dose Response confirmation of uHTS inhibitors of Mouse Intestinal Alkaline Phosphatase using Human Intestinal Alkaline Phosphatase PubChem Bioassay (2010)[AID] 
Target
Name:
Intestinal-type alkaline phosphatase
Synonyms:
ALPI Intestinal alkaline phosphatase | PPBI_HUMAN
Type:
PROTEIN
Mol. Mass.:
56804.94
Organism:
Homo sapiens (Human)
Description:
ChEMBL_1278525
Residue:
528
  
Inhibitor
Name:
BDBM76192
Synonyms:
4-[(E)-3-[6-(hydroxymethyl)-3,4,5-tris(oxidanyl)oxan-2-yl]oxybut-1-enyl]-3,3,5-trimethyl-4-oxidanyl-cyclohexan-1-one 4-hydroxy-3,3,5-trimethyl-4-[(E)-3-[3,4,5-trihydroxy-6-(hydroxymethyl)oxan-2-yl]oxybut-1-enyl]cyclohexan-1-one MLS000876984 cid_16196969
Type:
Small organic molecule
Emp. Form.:
C19H32O8
Mol. Mass.:
388.4526
SMILES:
CC(OC1OC(CO)C(O)C(O)C1O)\C=C\C1(O)C(C)CC(=O)CC1(C)C
: