Target
Intestinal-type alkaline phosphatase
Ligand
BDBM60796
Substrate
Meas. Tech.
Dose Response confirmation of uHTS inhibitors of Mouse Intestinal Alkaline Phosphatase using Human Intestinal Alkaline Phosphatase
IC50
<195±n/a nM
Citation
 PubChem, PC Dose Response confirmation of uHTS inhibitors of Mouse Intestinal Alkaline Phosphatase using Human Intestinal Alkaline Phosphatase PubChem Bioassay (2010)[AID] 
Target
Name:
Intestinal-type alkaline phosphatase
Synonyms:
ALPI Intestinal alkaline phosphatase | PPBI_HUMAN
Type:
PROTEIN
Mol. Mass.:
56804.94
Organism:
Homo sapiens (Human)
Description:
ChEMBL_1278525
Residue:
528
  
Inhibitor
Name:
BDBM60796
Synonyms:
1-(4-morpholin-4-ylsulfonylphenyl)-3-[[(Z)-(3-oxidanyl-4-oxidanylidene-cyclohexa-2,5-dien-1-ylidene)methyl]amino]thiourea 1-[[(Z)-(3-hydroxy-4-oxo-1-cyclohexa-2,5-dienylidene)methyl]amino]-3-[4-(4-morpholinylsulfonyl)phenyl]thiourea MLS000759830 cid_6508400
Type:
Small organic molecule
Emp. Form.:
C18H20N4O5S2
Mol. Mass.:
436.505
SMILES:
Oc1ccc(C=NNC(=S)Nc2ccc(cc2)S(=O)(=O)N2CCOCC2)cc1O
: