Target
Alkaline phosphatase, germ cell type
Ligand
BDBM76157
Substrate
Meas. Tech.
Dose Response confirmation of uHTS activators of Mouse Intestinal Alkaline Phosphatase using Placental Alkaline Phosphatase
EC50
64600±n/a nM
Citation
 PubChem, PC Dose Response confirmation of uHTS activators of Mouse Intestinal Alkaline Phosphatase using Placental Alkaline Phosphatase PubChem Bioassay (2010)[AID] 
Target
Name:
Alkaline phosphatase, germ cell type
Synonyms:
ALPG ALPPL2 PPBN_HUMAN | placental-like alkaline phosphatase preproprotein
Type:
PROTEIN
Mol. Mass.:
57374.31
Organism:
Homo sapiens (Human)
Description:
ChEMBL_29964
Residue:
532
  
Inhibitor
Name:
BDBM76157
Synonyms:
MLS001096064 N-(2,4-dimethylphenyl)-2-[methyl-[(2-oxidanylidene-3H-1,3-benzoxazol-6-yl)sulfonyl]amino]ethanamide SMR000631036 | cid_20949419
Type:
Small organic molecule
Emp. Form.:
C18H19N3O5S
Mol. Mass.:
389.426
SMILES:
CN(CC(=O)Nc1ccc(C)cc1C)S(=O)(=O)c1ccc2[nH]c(=O)oc2c1
: