Target
Alkaline phosphatase, germ cell type
Ligand
BDBM64368
Substrate
Meas. Tech.
Dose Response confirmation of uHTS activators of Mouse Intestinal Alkaline Phosphatase using Placental Alkaline Phosphatase
EC50
69800±n/a nM
Citation
 PubChem, PC Dose Response confirmation of uHTS activators of Mouse Intestinal Alkaline Phosphatase using Placental Alkaline Phosphatase PubChem Bioassay (2010)[AID] 
Target
Name:
Alkaline phosphatase, germ cell type
Synonyms:
ALPG ALPPL2 PPBN_HUMAN | placental-like alkaline phosphatase preproprotein
Type:
PROTEIN
Mol. Mass.:
57374.31
Organism:
Homo sapiens (Human)
Description:
ChEMBL_29964
Residue:
532
  
Inhibitor
Name:
BDBM64368
Synonyms:
MLS001096044 N-(5-chloro-2,4-dimethoxy-phenyl)-2-[(2-keto-3H-1,3-benzoxazol-6-yl)sulfonyl-methyl-amino]acetamide SMR000631034 | cid_20949400
Type:
Small organic molecule
Emp. Form.:
C18H18ClN3O7S
Mol. Mass.:
455.869
SMILES:
COc1cc(OC)c(NC(=O)CN(C)S(=O)(=O)c2ccc3[nH]c(=O)oc3c2)cc1Cl
: