Target
Alkaline phosphatase, germ cell type
Ligand
BDBM57406
Substrate
Meas. Tech.
Dose Response confirmation of uHTS inhibitors of Mouse Intestinal Alkaline Phosphatase using Placental Alkaline Phosphatase
IC50
>100000±n/a nM
Citation
 PubChem, PC Dose Response confirmation of uHTS inhibitors of Mouse Intestinal Alkaline Phosphatase using Placental Alkaline Phosphatase PubChem Bioassay (2010)[AID] 
Target
Name:
Alkaline phosphatase, germ cell type
Synonyms:
ALPG ALPPL2 PPBN_HUMAN | placental-like alkaline phosphatase preproprotein
Type:
PROTEIN
Mol. Mass.:
57374.31
Organism:
Homo sapiens (Human)
Description:
ChEMBL_29964
Residue:
532
  
Inhibitor
Name:
BDBM57406
Synonyms:
1-(4-chloranyl-2-methyl-phenyl)-3-(3,3-diphenylpropyl)thiourea 1-(4-chloro-2-methylphenyl)-3-(3,3-diphenylpropyl)thiourea N-(4-chloro-2-methylphenyl)-N'-(3,3-diphenylpropyl)thiourea cid_2171179
Type:
Small organic molecule
Emp. Form.:
C23H23ClN2S
Mol. Mass.:
394.96
SMILES:
Cc1cc(Cl)ccc1NC(=S)NCCC(c1ccccc1)c1ccccc1
: