Target
Alkaline phosphatase, germ cell type
Ligand
BDBM46609
Substrate
Meas. Tech.
Dose Response confirmation of uHTS inhibitors of Mouse Intestinal Alkaline Phosphatase using Placental Alkaline Phosphatase
IC50
23000±n/a nM
Citation
 PubChem, PC Dose Response confirmation of uHTS inhibitors of Mouse Intestinal Alkaline Phosphatase using Placental Alkaline Phosphatase PubChem Bioassay (2010)[AID] 
Target
Name:
Alkaline phosphatase, germ cell type
Synonyms:
ALPG ALPPL2 PPBN_HUMAN | placental-like alkaline phosphatase preproprotein
Type:
PROTEIN
Mol. Mass.:
57374.31
Organism:
Homo sapiens (Human)
Description:
ChEMBL_29964
Residue:
532
  
Inhibitor
Name:
BDBM46609
Synonyms:
1,3-bis(1H-1,2,4-triazol-5-ylsulfanyl)propan-2-one 1,3-bis(1H-1,2,4-triazol-5-ylthio)acetone cid_1625367
Type:
Small organic molecule
Emp. Form.:
C7H8N6OS2
Mol. Mass.:
256.308
SMILES:
O=C(CSc1nnc[nH]1)CSc1nnc[nH]1
: